STR #2758

FLTK matrix user chat room
(using Element browser app)   FLTK gitter user chat room   GitHub FLTK Project   FLTK News RSS Feed  
  FLTK Apps      FLTK Library      Forums      Links     Login 
 Home  |  Articles & FAQs  |  Bugs & Features  |  Documentation  |  Download  |  Screenshots  ]
 

Return to Bugs & Features | Roadmap 2.0 | Post Text | Post File | SVN ⇄ GIT ]

STR #2758

Application:FLTK Library
Status:5 - New
Priority:3 - Moderate, e.g. unable to compile the software
Scope:2 - Specific to an operating system
Subsystem:Unassigned
Summary:fltk-2 lock.cxx fails with gcc-4.6.1
Version:2.0-current
Created By:szukw000
Assigned To:Unassigned
Fix Version:Unassigned
Update Notification:

Receive EMails Don't Receive EMails

Trouble Report Files:

Post File ]
Name/Time/Date Filename/Size top right image
 
#1 szukw000
10:51 Oct 30, 2011
fltk-2.0.x-alpha-r9042-lock.cxx.dif.gz
0k
 
bottom left image   bottom right image

Trouble Report Comments:

Post Text ]
Name/Time/Date Text top right image
 
#1 szukw000
10:51 Oct 30, 2011
lock.cxx:160:76: error: braces around scalar initializer for type 'int'
make[1]: *** [lock.o] Error 1
make: *** [all] Error 2

The attached patch helps on a LINUX machine.

winfried
 
bottom left image   bottom right image

Return to Bugs & Features | Post Text | Post File ]

 
 

Comments are owned by the poster. All other content is copyright 1998-2024 by Bill Spitzak and others. This project is hosted by The FLTK Team. Please report site problems to 'erco@seriss.com'.